+ packages='falter-standard -luci-proto-ppp -kmod-ppp -kmod-pppoe -kmod-pppox -ppp -ppp-mod-pppoe'
++ echo 'SELECT flashmb, rammb FROM toh WHERE firmwareopenwrtinstallurl LIKE '\''%ti_omap4-panda%'\'' OR firmwareopenwrtupgradeurl LIKE '\''%ti_omap4-panda%'\'' OR firmwareopenwrtsnapshotupgradeurl LIKE '\''%ti_omap4-panda%'\'' OR firmwareopenwrtsnapshotupgradeurl LIKE '\''%ti_omap4-panda%'\'' LIMIT 1'
++ sqlite3 -batch /work/tmp/toh.db
+ info=
+ smallflash=false
++ echo ''
++ cut '-d|' -f 1
++ sed -E 's/[^0-9]*([0-9]+)[^0-9]*.*/\1/'
+ flashmb=
+ '[' -n '' ']'
+ [[ ti_omap4-panda =~ ubnt_unifi-ap$|ubnt_unifi-ap-lr$|ubnt_usw-flex ]]
+ false
+ packages='falter-bigflash falter-standard -luci-proto-ppp -kmod-ppp -kmod-pppoe -kmod-pppox -ppp -ppp-mod-pppoe'
++ echo ''
++ cut '-d|' -f 2
++ sed -E 's/[^0-9]*([0-9]+)[^0-9]*.*/\1/'
+ rammb=
+ '[' -n '' ']'
++ make info
++ grep ti_omap4-panda: -A 2
++ tail -n1
++ cut -d: -f2
+ devpkgs=' kmod-usb-net-smsc95xx'
+ [[  base-files ca-bundle dropbear fstools libc libgcc libustream-mbedtls logd mtd netifd uci uclient-fetch urandom-seed urngd mkf2fs e2fsprogs procd-ujail partx-utils dnsmasq firewall4 nftables kmod-nft-offload odhcp6c odhcpd-ipv6only ppp ppp-mod-pppoe apk-mbedtls =~ wpad-basic-mbedtls ]]
+ [[  kmod-usb-net-smsc95xx =~ ath10k-firmware-qca9887 ]]
+ [[  kmod-usb-net-smsc95xx =~ ath10k-firmware-qca988x ]]
+ '[' xomap/generic = xx86/64 ']'
+ false
+ make image PROFILE=ti_omap4-panda 'PACKAGES=falter-bigflash falter-standard -luci-proto-ppp -kmod-ppp -kmod-pppoe -kmod-pppox -ppp -ppp-mod-pppoe' 'DISABLED_SERVICES=prometheus-push olsrd6' FILES=embedded-files EXTRA_IMAGE_NAME=freifunk-falter-snapshot
Building images for omap - PandaBoard.org OMAP4 TI pandaboard
Packages: falter-bigflash falter-standard apk-mbedtls base-files ca-bundle dnsmasq dropbear e2fsprogs firewall4 fstools kernel kmod-nft-offload kmod-usb-net-smsc95xx libc libgcc libustream-mbedtls logd mkf2fs mtd netifd nftables odhcp6c odhcpd-ipv6only partx-utils procd-ujail uci uclient-fetch urandom-seed urngd "base-files=1718~20c44f41b2" "libc=1.2.6-r5" "kernel=6.18.55~9ad4bcb8b19b19cbe14f4b884bae7880-r1"

OK: 0 B in 0 packages

Installing packages...
ERROR: unable to select packages:
  uhttpd (no such package):
    required by: prometheus-node-exporter-ucode-2024.02.07-r3[uhttpd]
                 luci-light-26.291.67080~0a601b6[uhttpd]
                 falter-common-5[uhttpd>=0]
                 falter-berlin-service-registrar-0.2[uhttpd>=0]
  uhttpd-mod-ucode (no such package):
    required by: prometheus-node-exporter-ucode-2024.02.07-r3[uhttpd-mod-ucode]
  uhttpd-mod-ubus (no such package):
    required by: luci-light-26.291.67080~0a601b6[uhttpd-mod-ubus]
                 falter-common-5[uhttpd-mod-ubus>=0]
make[2]: *** [Makefile:266: package_install] Error 17
make[1]: *** [Makefile:195: _call_image] Error 2
make: *** [Makefile:383: image] Error 2
+ true
