+ packages='falter-standard -luci-proto-ppp -kmod-ppp -kmod-pppoe -kmod-pppox -ppp -ppp-mod-pppoe'
++ echo 'SELECT flashmb, rammb FROM toh WHERE firmwareopenwrtinstallurl LIKE '\''%Default%'\'' OR firmwareopenwrtupgradeurl LIKE '\''%Default%'\'' OR firmwareopenwrtsnapshotupgradeurl LIKE '\''%Default%'\'' OR firmwareopenwrtsnapshotupgradeurl LIKE '\''%Default%'\'' LIMIT 1'
++ sqlite3 -batch /work/tmp/toh.db
+ info=
+ smallflash=false
++ echo ''
++ cut '-d|' -f 1
++ sed -E 's/[^0-9]*([0-9]+)[^0-9]*.*/\1/'
+ flashmb=
+ '[' -n '' ']'
+ [[ Default =~ ubnt_unifi-ap$|ubnt_unifi-ap-lr$|ubnt_usw-flex ]]
+ false
+ packages='falter-bigflash falter-standard -luci-proto-ppp -kmod-ppp -kmod-pppoe -kmod-pppox -ppp -ppp-mod-pppoe'
++ echo ''
++ cut '-d|' -f 2
++ sed -E 's/[^0-9]*([0-9]+)[^0-9]*.*/\1/'
+ rammb=
+ '[' -n '' ']'
++ make info
++ grep Default: -A 2
++ tail -n1
++ cut -d: -f2
make: TMPDIR value /work/tmp/snapshot/omap/generic/tmp: No such file or directory
make: using default temporary directory '/tmp'
+ devpkgs=' kmod-usb-net-asix kmod-usb-net-asix-ax88179 kmod-usb-net-hso kmod-usb-net-kaweth kmod-usb-net-pegasus kmod-usb-net-mcs7830 kmod-usb-net-smsc95xx kmod-usb-net-dm9601-ether wpad-basic-mbedtls'
+ [[  base-files ca-bundle dropbear fstools libc libgcc libustream-mbedtls logd mtd netifd uci uclient-fetch urandom-seed urngd mkf2fs e2fsprogs procd-ujail partx-utils dnsmasq firewall4 nftables kmod-nft-offload odhcp6c odhcpd-ipv6only ppp ppp-mod-pppoe apk-mbedtls =~ wpad-basic-mbedtls ]]
+ [[  kmod-usb-net-asix kmod-usb-net-asix-ax88179 kmod-usb-net-hso kmod-usb-net-kaweth kmod-usb-net-pegasus kmod-usb-net-mcs7830 kmod-usb-net-smsc95xx kmod-usb-net-dm9601-ether wpad-basic-mbedtls =~ ath10k-firmware-qca9887 ]]
+ [[  kmod-usb-net-asix kmod-usb-net-asix-ax88179 kmod-usb-net-hso kmod-usb-net-kaweth kmod-usb-net-pegasus kmod-usb-net-mcs7830 kmod-usb-net-smsc95xx kmod-usb-net-dm9601-ether wpad-basic-mbedtls =~ ath10k-firmware-qca988x ]]
+ '[' xomap/generic = xx86/64 ']'
+ false
+ make image PROFILE=Default 'PACKAGES=falter-bigflash falter-standard -luci-proto-ppp -kmod-ppp -kmod-pppoe -kmod-pppox -ppp -ppp-mod-pppoe' 'DISABLED_SERVICES=prometheus-push olsrd6' FILES=embedded-files EXTRA_IMAGE_NAME=freifunk-falter-snapshot
make: TMPDIR value /work/tmp/snapshot/omap/generic/tmp: No such file or directory
make: using default temporary directory '/tmp'
make: TMPDIR value /work/tmp/snapshot/omap/generic/tmp: No such file or directory
make: using default temporary directory '/tmp'
make: TMPDIR value /work/tmp/snapshot/omap/generic/tmp: No such file or directory
make: using default temporary directory '/tmp'
Generate local signing keys...
WARNING: can't open config file: /builder/shared-workdir/build/staging_dir/host/etc/ssl/openssl.cnf
WARNING: can't open config file: /builder/shared-workdir/build/staging_dir/host/etc/ssl/openssl.cnf
read EC key
writing EC key
make: TMPDIR value /work/tmp/snapshot/omap/generic/tmp: No such file or directory
make: using default temporary directory '/tmp'
Checking 'true'... ok.
Checking 'false'... ok.
Checking 'working-make'... ok.
Checking 'case-sensitive-fs'... ok.
Checking 'proper-umask'... ok.
Checking 'perl-data-dumper'... ok.
Checking 'perl-findbin'... ok.
Checking 'perl-file-copy'... ok.
Checking 'perl-file-compare'... ok.
Checking 'perl-thread-queue'... ok.
Checking 'perl-ipc-cmd'... ok.
Checking 'tar'... ok.
Checking 'find'... ok.
Checking 'bash'... updated.
Checking 'xargs'... ok.
Checking 'patch'... ok.
Checking 'diff'... ok.
Checking 'cp'... ok.
Checking 'seq'... ok.
Checking 'awk'... ok.
Checking 'grep'... updated.
Checking 'egrep'... updated.
Checking 'getopt'... ok.
Checking 'realpath'... ok.
Checking 'stat'... ok.
Checking 'gzip'... updated.
Checking 'unzip'... ok.
Checking 'bzip2'... ok.
Checking 'wget'... ok.
Checking 'install'... ok.
Checking 'perl'... ok.
Checking 'python'... updated.
Checking 'python3'... updated.
Checking 'python3-distutils'... ok.
Checking 'python3-stdlib'... ok.
Checking 'file'... ok.
Checking 'which'... ok.
Checking 'ldconfig-stub'... ok.
Building images for omap - Default Profile
Packages: falter-bigflash falter-standard apk-mbedtls base-files ca-bundle dnsmasq dropbear e2fsprogs firewall4 fstools kernel kmod-nft-offload kmod-usb-net-asix kmod-usb-net-asix-ax88179 kmod-usb-net-dm9601-ether kmod-usb-net-hso kmod-usb-net-kaweth kmod-usb-net-mcs7830 kmod-usb-net-pegasus kmod-usb-net-smsc95xx libc libgcc libustream-mbedtls logd mkf2fs mtd netifd nftables odhcp6c odhcpd-ipv6only partx-utils procd-ujail uci uclient-fetch urandom-seed urngd wpad-basic-mbedtls "base-files=1718~20c44f41b2" "libc=1.2.6-r5" "kernel=6.18.55~9ad4bcb8b19b19cbe14f4b884bae7880-r1"

WARNING: opening /work/tmp/snapshot/omap/generic/packages/packages.adb: No such file or directory
OK: 0 B in 0 packages
Package list missing or not up-to-date, generating it.

Building package index...

Installing packages...
ERROR: unable to select packages:
  uhttpd (no such package):
    required by: prometheus-node-exporter-ucode-2024.02.07-r3[uhttpd]
                 luci-light-26.291.67080~0a601b6[uhttpd]
                 falter-common-5[uhttpd>=0]
                 falter-berlin-service-registrar-0.2[uhttpd>=0]
  uhttpd-mod-ucode (no such package):
    required by: prometheus-node-exporter-ucode-2024.02.07-r3[uhttpd-mod-ucode]
  uhttpd-mod-ubus (no such package):
    required by: luci-light-26.291.67080~0a601b6[uhttpd-mod-ubus]
                 falter-common-5[uhttpd-mod-ubus>=0]
make[2]: *** [Makefile:266: package_install] Error 17
make[1]: *** [Makefile:195: _call_image] Error 2
make: *** [Makefile:383: image] Error 2
+ true
