+ packages='falter-standard -luci-proto-ppp -kmod-ppp -kmod-pppoe -kmod-pppox -ppp -ppp-mod-pppoe'
++ echo 'SELECT flashmb, rammb FROM toh WHERE firmwareopenwrtinstallurl LIKE '\''%tplink_eap225-v5%'\'' OR firmwareopenwrtupgradeurl LIKE '\''%tplink_eap225-v5%'\'' OR firmwareopenwrtsnapshotupgradeurl LIKE '\''%tplink_eap225-v5%'\'' OR firmwareopenwrtsnapshotupgradeurl LIKE '\''%tplink_eap225-v5%'\'' LIMIT 1'
++ sqlite3 -batch /work/tmp/toh.db
+ info='16|128'
+ smallflash=false
++ echo '16|128'
++ cut '-d|' -f 1
++ sed -E 's/[^0-9]*([0-9]+)[^0-9]*.*/\1/'
+ flashmb=16
+ '[' -n 16 ']'
+ '[' 16 -le 8 ']'
+ [[ tplink_eap225-v5 =~ ubnt_unifi-ap$|ubnt_unifi-ap-lr$|ubnt_usw-flex ]]
+ false
+ packages='falter-bigflash falter-standard -luci-proto-ppp -kmod-ppp -kmod-pppoe -kmod-pppox -ppp -ppp-mod-pppoe'
++ echo '16|128'
++ cut '-d|' -f 2
++ sed -E 's/[^0-9]*([0-9]+)[^0-9]*.*/\1/'
+ rammb=128
+ '[' -n 128 ']'
+ '[' 128 -le 32 ']'
++ make info
++ grep tplink_eap225-v5: -A 2
++ cut -d: -f2
++ tail -n1
+ devpkgs=' '
+ [[  base-files ca-bundle dropbear fstools libc libgcc libustream-mbedtls logd mtd netifd uci uclient-fetch urandom-seed urngd kmod-leds-gpio kmod-gpio-button-hotplug procd-ujail dnsmasq firewall4 nftables kmod-nft-offload odhcp6c odhcpd-ipv6only ppp ppp-mod-pppoe apk-mbedtls =~ wpad-basic-mbedtls ]]
+ [[   =~ ath10k-firmware-qca9887 ]]
+ [[   =~ ath10k-firmware-qca988x ]]
+ '[' xmediatek/mt7629 = xx86/64 ']'
+ false
+ make image PROFILE=tplink_eap225-v5 'PACKAGES=falter-bigflash falter-standard -luci-proto-ppp -kmod-ppp -kmod-pppoe -kmod-pppox -ppp -ppp-mod-pppoe' 'DISABLED_SERVICES=prometheus-push olsrd6' FILES=embedded-files EXTRA_IMAGE_NAME=freifunk-falter-snapshot
Building images for mediatek - TP-Link EAP225 v5
Packages: falter-bigflash falter-standard apk-mbedtls base-files ca-bundle dnsmasq dropbear firewall4 fstools kernel kmod-gpio-button-hotplug kmod-leds-gpio kmod-nft-offload libc libgcc libustream-mbedtls logd mtd netifd nftables odhcp6c odhcpd-ipv6only procd-ujail uci uclient-fetch urandom-seed urngd "base-files=1718~20c44f41b2" "libc=1.2.6-r5" "kernel=6.18.55~5b02f38b9d3e52d1e872b4e42ccb616f-r1"

OK: 0 B in 0 packages

Installing packages...
ERROR: unable to select packages:
  uhttpd (no such package):
    required by: prometheus-node-exporter-ucode-2024.02.07-r3[uhttpd]
                 luci-light-26.291.67080~0a601b6[uhttpd]
                 falter-common-5[uhttpd>=0]
                 falter-berlin-service-registrar-0.2[uhttpd>=0]
  uhttpd-mod-ucode (no such package):
    required by: prometheus-node-exporter-ucode-2024.02.07-r3[uhttpd-mod-ucode]
  uhttpd-mod-ubus (no such package):
    required by: luci-light-26.291.67080~0a601b6[uhttpd-mod-ubus]
                 falter-common-5[uhttpd-mod-ubus>=0]
make[2]: *** [Makefile:266: package_install] Error 17
make[1]: *** [Makefile:195: _call_image] Error 2
make: *** [Makefile:383: image] Error 2
+ true
