+ packages='falter-standard -luci-proto-ppp -kmod-ppp -kmod-pppoe -kmod-pppox -ppp -ppp-mod-pppoe'
++ echo 'SELECT flashmb, rammb FROM toh WHERE firmwareopenwrtinstallurl LIKE '\''%iptime_a6004mx%'\'' OR firmwareopenwrtupgradeurl LIKE '\''%iptime_a6004mx%'\'' OR firmwareopenwrtsnapshotupgradeurl LIKE '\''%iptime_a6004mx%'\'' OR firmwareopenwrtsnapshotupgradeurl LIKE '\''%iptime_a6004mx%'\'' LIMIT 1'
++ sqlite3 -batch /work/tmp/toh.db
+ info='128|128'
+ smallflash=false
++ echo '128|128'
++ cut '-d|' -f 1
++ sed -E 's/[^0-9]*([0-9]+)[^0-9]*.*/\1/'
+ flashmb=128
+ '[' -n 128 ']'
+ '[' 128 -le 8 ']'
+ [[ iptime_a6004mx =~ ubnt_unifi-ap$|ubnt_unifi-ap-lr$|ubnt_usw-flex ]]
+ false
+ packages='falter-bigflash falter-standard -luci-proto-ppp -kmod-ppp -kmod-pppoe -kmod-pppox -ppp -ppp-mod-pppoe'
++ echo '128|128'
++ sed -E 's/[^0-9]*([0-9]+)[^0-9]*.*/\1/'
++ cut '-d|' -f 2
+ rammb=128
+ '[' -n 128 ']'
+ '[' 128 -le 32 ']'
++ make info
++ grep iptime_a6004mx: -A 2
++ cut -d: -f2
++ tail -n1
make: TMPDIR value /work/tmp/snapshot/mediatek/mt7629/tmp: No such file or directory
make: using default temporary directory '/tmp'
+ devpkgs=' kmod-usb3 uboot-envtools'
+ [[  base-files ca-bundle dropbear fstools libc libgcc libustream-mbedtls logd mtd netifd uci uclient-fetch urandom-seed urngd kmod-leds-gpio kmod-gpio-button-hotplug procd-ujail dnsmasq firewall4 nftables kmod-nft-offload odhcp6c odhcpd-ipv6only ppp ppp-mod-pppoe apk-mbedtls =~ wpad-basic-mbedtls ]]
+ [[  kmod-usb3 uboot-envtools =~ ath10k-firmware-qca9887 ]]
+ [[  kmod-usb3 uboot-envtools =~ ath10k-firmware-qca988x ]]
+ '[' xmediatek/mt7629 = xx86/64 ']'
+ false
+ make image PROFILE=iptime_a6004mx 'PACKAGES=falter-bigflash falter-standard -luci-proto-ppp -kmod-ppp -kmod-pppoe -kmod-pppox -ppp -ppp-mod-pppoe' 'DISABLED_SERVICES=prometheus-push olsrd6' FILES=embedded-files EXTRA_IMAGE_NAME=freifunk-falter-snapshot
make: TMPDIR value /work/tmp/snapshot/mediatek/mt7629/tmp: No such file or directory
make: using default temporary directory '/tmp'
make: TMPDIR value /work/tmp/snapshot/mediatek/mt7629/tmp: No such file or directory
make: using default temporary directory '/tmp'
make: TMPDIR value /work/tmp/snapshot/mediatek/mt7629/tmp: No such file or directory
make: using default temporary directory '/tmp'
Generate local signing keys...
WARNING: can't open config file: /builder/shared-workdir/build/staging_dir/host/etc/ssl/openssl.cnf
WARNING: can't open config file: /builder/shared-workdir/build/staging_dir/host/etc/ssl/openssl.cnf
read EC key
writing EC key
make: TMPDIR value /work/tmp/snapshot/mediatek/mt7629/tmp: No such file or directory
make: using default temporary directory '/tmp'
Checking 'true'... ok.
Checking 'false'... ok.
Checking 'working-make'... ok.
Checking 'case-sensitive-fs'... ok.
Checking 'proper-umask'... ok.
Checking 'perl-data-dumper'... ok.
Checking 'perl-findbin'... ok.
Checking 'perl-file-copy'... ok.
Checking 'perl-file-compare'... ok.
Checking 'perl-thread-queue'... ok.
Checking 'perl-ipc-cmd'... ok.
Checking 'tar'... ok.
Checking 'find'... ok.
Checking 'bash'... updated.
Checking 'xargs'... ok.
Checking 'patch'... ok.
Checking 'diff'... ok.
Checking 'cp'... ok.
Checking 'seq'... ok.
Checking 'awk'... ok.
Checking 'grep'... updated.
Checking 'egrep'... updated.
Checking 'getopt'... ok.
Checking 'realpath'... ok.
Checking 'stat'... ok.
Checking 'gzip'... updated.
Checking 'unzip'... ok.
Checking 'bzip2'... ok.
Checking 'wget'... ok.
Checking 'install'... ok.
Checking 'perl'... ok.
Checking 'python'... updated.
Checking 'python3'... updated.
Checking 'python3-distutils'... ok.
Checking 'python3-stdlib'... ok.
Checking 'file'... ok.
Checking 'which'... ok.
Checking 'ldconfig-stub'... ok.
Building images for mediatek - ipTIME A6004MX
Packages: falter-bigflash falter-standard apk-mbedtls base-files ca-bundle dnsmasq dropbear firewall4 fstools kernel kmod-gpio-button-hotplug kmod-leds-gpio kmod-nft-offload kmod-usb3 libc libgcc libustream-mbedtls logd mtd netifd nftables odhcp6c odhcpd-ipv6only procd-ujail uboot-envtools uci uclient-fetch urandom-seed urngd "base-files=1718~20c44f41b2" "libc=1.2.6-r5" "kernel=6.18.55~5b02f38b9d3e52d1e872b4e42ccb616f-r1"

WARNING: opening /work/tmp/snapshot/mediatek/mt7629/packages/packages.adb: No such file or directory
OK: 0 B in 0 packages
Package list missing or not up-to-date, generating it.

Building package index...

Installing packages...
ERROR: unable to select packages:
  uhttpd (no such package):
    required by: prometheus-node-exporter-ucode-2024.02.07-r3[uhttpd]
                 luci-light-26.291.67080~0a601b6[uhttpd]
                 falter-common-5[uhttpd>=0]
                 falter-berlin-service-registrar-0.2[uhttpd>=0]
  uhttpd-mod-ucode (no such package):
    required by: prometheus-node-exporter-ucode-2024.02.07-r3[uhttpd-mod-ucode]
  uhttpd-mod-ubus (no such package):
    required by: luci-light-26.291.67080~0a601b6[uhttpd-mod-ubus]
                 falter-common-5[uhttpd-mod-ubus>=0]
make[2]: *** [Makefile:266: package_install] Error 17
make[1]: *** [Makefile:195: _call_image] Error 2
make: *** [Makefile:383: image] Error 2
+ true
