+ packages='falter-notunnel -luci-proto-ppp -kmod-ppp -kmod-pppoe -kmod-pppox -ppp -ppp-mod-pppoe'
++ echo 'SELECT flashmb, rammb FROM toh WHERE firmwareopenwrtinstallurl LIKE '\''%enterasys_ws-ap3710i%'\'' OR firmwareopenwrtupgradeurl LIKE '\''%enterasys_ws-ap3710i%'\'' OR firmwareopenwrtsnapshotupgradeurl LIKE '\''%enterasys_ws-ap3710i%'\'' OR firmwareopenwrtsnapshotupgradeurl LIKE '\''%enterasys_ws-ap3710i%'\'' LIMIT 1'
++ sqlite3 -batch /work/tmp/toh.db
+ info='32|256'
+ smallflash=false
++ echo '32|256'
++ cut '-d|' -f 1
++ sed -E 's/[^0-9]*([0-9]+)[^0-9]*.*/\1/'
+ flashmb=32
+ '[' -n 32 ']'
+ '[' 32 -le 8 ']'
+ [[ enterasys_ws-ap3710i =~ ubnt_unifi-ap$|ubnt_unifi-ap-lr$|ubnt_usw-flex ]]
+ false
+ packages='falter-bigflash falter-notunnel -luci-proto-ppp -kmod-ppp -kmod-pppoe -kmod-pppox -ppp -ppp-mod-pppoe'
++ echo '32|256'
++ cut '-d|' -f 2
++ sed -E 's/[^0-9]*([0-9]+)[^0-9]*.*/\1/'
+ rammb=256
+ '[' -n 256 ']'
+ '[' 256 -le 32 ']'
++ make info
++ grep enterasys_ws-ap3710i: -A 2
++ tail -n1
++ cut -d: -f2
+ devpkgs=' kmod-phy-at803x'
+ [[  base-files ca-bundle dropbear fstools libc libgcc libustream-mbedtls logd mtd netifd uci uclient-fetch urandom-seed urngd kmod-gpio-button-hotplug kmod-leds-gpio kmod-ath9k wpad-basic-mbedtls kmod-usb2 uboot-envtools kmod-crypto-hw-talitos procd-ujail dnsmasq firewall4 nftables kmod-nft-offload odhcp6c odhcpd-ipv6only ppp ppp-mod-pppoe apk-mbedtls =~ wpad-basic-mbedtls ]]
+ [[  kmod-phy-at803x =~ -wpad-basic-mbedtls ]]
+ packages='-wpad-basic-mbedtls wpad-mesh-mbedtls falter-bigflash falter-notunnel -luci-proto-ppp -kmod-ppp -kmod-pppoe -kmod-pppox -ppp -ppp-mod-pppoe'
+ [[  kmod-phy-at803x =~ ath10k-firmware-qca9887 ]]
+ [[  kmod-phy-at803x =~ ath10k-firmware-qca988x ]]
+ '[' xmpc85xx/p1020 = xx86/64 ']'
+ false
+ make image PROFILE=enterasys_ws-ap3710i 'PACKAGES=-wpad-basic-mbedtls wpad-mesh-mbedtls falter-bigflash falter-notunnel -luci-proto-ppp -kmod-ppp -kmod-pppoe -kmod-pppox -ppp -ppp-mod-pppoe' 'DISABLED_SERVICES=prometheus-push olsrd6' FILES=embedded-files EXTRA_IMAGE_NAME=freifunk-falter-snapshot
Building images for mpc85xx - Enterasys WS-AP3710i
Packages: wpad-mesh-mbedtls falter-bigflash falter-notunnel apk-mbedtls base-files ca-bundle dnsmasq dropbear firewall4 fstools kernel kmod-ath9k kmod-crypto-hw-talitos kmod-gpio-button-hotplug kmod-leds-gpio kmod-nft-offload kmod-phy-at803x kmod-usb2 libc libgcc libustream-mbedtls logd mtd netifd nftables odhcp6c odhcpd-ipv6only procd-ujail uboot-envtools uci uclient-fetch urandom-seed urngd "base-files=1718~46309f1396" "libc=1.2.6-r5" "kernel=6.18.55~738e6fe21d4497da560ffc6ddb9e6b52-r1"

OK: 0 B in 0 packages

Installing packages...
ERROR: unable to select packages:
  logd (no such package):
    required by: world[logd]
  netifd (no such package):
    required by: world[netifd]
                 wifi-scripts-1.0-r4[netifd]
                 base-files-1718~46309f1396[netifd]
  uclient-fetch (no such package):
    required by: world[uclient-fetch]
                 falter-berlin-owm-ucode-1.4[uclient-fetch>=0]
  wpad-mesh-mbedtls (no such package):
    required by: world[wpad-mesh-mbedtls]
  wget-any (virtual):
    note: please select one of the 'provided by'
          packages explicitly
    provided by: wget-nossl wget-ssl
    required by: apk-mbedtls-3.0.5-r4[wget-any]
  ubox (no such package):
    required by: fstools-2026.07.25~2aa16407-r1[ubox]
  procd (no such package):
    required by: base-files-1718~46309f1396[procd]
  procd-seccomp (no such package):
    required by: base-files-1718~46309f1396[procd-seccomp]
  ucode (no such package):
    required by: wifi-scripts-1.0-r4[ucode]
                 base-files-1718~46309f1396[ucode]
                 luci-theme-bootstrap-26.291.67080~0a601b6[ucode>=2026.02.27]
                 falter-berlin-owm-ucode-1.4[ucode>=0]
                 luci-mod-status-26.291.67080~0a601b6[ucode>=2026.02.27]
                 firewall4-2025.03.17~b6e51575-r2[ucode>=2022.03.22]
  ucode-mod-digest (no such package):
    required by: wifi-scripts-1.0-r4[ucode-mod-digest]
                 base-files-1718~46309f1396[ucode-mod-digest]
  ucode-mod-fs (no such package):
    required by: falter-berlin-statistics-2028.10.09-r3[ucode-mod-fs>=0]
                 prometheus-node-exporter-ucode-2024.02.07-r3[ucode-mod-fs]
                 base-files-1718~46309f1396[ucode-mod-fs]
                 falter-berlin-owm-ucode-1.4[ucode-mod-fs>=0]
                 firewall4-2025.03.17~b6e51575-r2[ucode-mod-fs]
  luci-base (no such package):
    required by: luci-app-olsr-26.291.67080~0a601b6[luci-base]
                 luci-mod-system-26.291.67080~0a601b6[luci-base]
                 luci-app-package-manager-26.291.67080~0a601b6[luci-base]
                 luci-lua-runtime-26.291.67080~0a601b6[luci-base]
                 luci-mod-network-26.291.67080~0a601b6[luci-base]
                 luci-theme-bootstrap-26.291.67080~0a601b6[luci-base]
                 luci-mod-status-26.291.67080~0a601b6[luci-base]
                 luci-app-statistics-26.291.67080~0a601b6[luci-base]
                 luci-app-firewall-26.291.67080~0a601b6[luci-base]
                 luci-mod-admin-full-26.291.67080~0a601b6[luci-base]
                 luci-app-olsr-services-26.291.67080~0a601b6[luci-base]
  liblucihttp-lua (no such package):
    required by: luci-lua-runtime-26.291.67080~0a601b6[liblucihttp-lua]
                 luci-lib-base-26.291.67080~0a601b6[liblucihttp-lua]
  ucode-mod-lua (no such package):
    required by: luci-lua-runtime-26.291.67080~0a601b6[ucode-mod-lua]
  rpcd-mod-iwinfo (no such package):
    required by: luci-mod-network-26.291.67080~0a601b6[rpcd-mod-iwinfo]
                 luci-mod-status-26.291.67080~0a601b6[rpcd-mod-iwinfo]
  uhttpd (no such package):
    required by: prometheus-node-exporter-ucode-2024.02.07-r3[uhttpd]
                 luci-light-26.291.67080~0a601b6[uhttpd]
                 falter-common-5[uhttpd>=0]
                 falter-berlin-service-registrar-0.2[uhttpd>=0]
  ucode-mod-ubus (no such package):
    required by: falter-berlin-statistics-2028.10.09-r3[ucode-mod-ubus>=0]
                 wifi-scripts-1.0-r4[ucode-mod-ubus]
                 prometheus-node-exporter-ucode-2024.02.07-r3[ucode-mod-ubus]
                 falter-berlin-owm-ucode-1.4[ucode-mod-ubus>=0]
                 firewall4-2025.03.17~b6e51575-r2[ucode-mod-ubus]
  ucode-mod-uci (no such package):
    required by: falter-berlin-statistics-2028.10.09-r3[ucode-mod-uci>=0]
                 wifi-scripts-1.0-r4[ucode-mod-uci]
                 falter-berlin-owm-ucode-1.4[ucode-mod-uci>=0]
                 firewall4-2025.03.17~b6e51575-r2[ucode-mod-uci]
  luci-i18n-base-de (no such package):
    required by: falter-bigflash-5[luci-i18n-base-de>=0]
  ucode-mod-resolv (no such package):
    required by: falter-berlin-owm-ucode-1.4[ucode-mod-resolv>=0]
  ucode-mod-uloop (no such package):
    required by: falter-berlin-owm-ucode-1.4[ucode-mod-uloop>=0]
  rpcd (no such package):
    required by: prometheus-node-exporter-ucode-2024.02.07-r3[rpcd]
  uhttpd-mod-ucode (no such package):
    required by: prometheus-node-exporter-ucode-2024.02.07-r3[uhttpd-mod-ucode]
  ucode-mod-math (no such package):
    required by: falter-berlin-statistics-2028.10.09-r3[ucode-mod-math>=0]
  rpcd-mod-rrdns (no such package):
    required by: luci-light-26.291.67080~0a601b6[rpcd-mod-rrdns]
  uhttpd-mod-ubus (no such package):
    required by: luci-light-26.291.67080~0a601b6[uhttpd-mod-ubus]
                 falter-common-5[uhttpd-mod-ubus>=0]
  ucode-mod-nl80211 (no such package):
    required by: wifi-scripts-1.0-r4[ucode-mod-nl80211]
  ucode-mod-rtnl (no such package):
    required by: wifi-scripts-1.0-r4[ucode-mod-rtnl]
  hostapd-common (no such package):
    required by: kmod-mac80211-6.18.55.7.2-r9[hostapd-common]
  libudebug (no such package):
    required by: procd-ujail-2026.10.18~5aef7c33-r1[libudebug]
  getrandom (no such package):
    required by: urandom-seed-3[getrandom]
make[2]: *** [Makefile:266: package_install] Error 79
make[1]: *** [Makefile:195: _call_image] Error 2
make: *** [Makefile:383: image] Error 2
+ true
